Previous Thread  Next Thread

chat icon Compiles until

VelikM

Posted: Fri Dec 27, 2002 5:18 am
Joined: 14 Oct 2002
Posts: 80
To get to this point I, ../configure (powerpc-apple-darwin6.3) run make -k, then gnumake -k. Run ../configure --build=powerpc then run make -k and gnumake -k again, it has errors in decimation and bsd then stops here:

/bin/sh ../../../../libtool --mode=link gcc -g -O2 -o makesdna makesdna-makesdna.o ../../../../intern/guardedalloc/libblender_guardedalloc.la
gcc -g -O2 -o makesdna makesdna-makesdna.o ../../../../intern/guardedalloc/.libs/libblender_guardedalloc.a -lGLU -lGL -lm -ljpeg -lpng -lcrypto -lssl -lpthread -ldl -lstdc++ -lz
ld: can't locate file for: -lGLU
gnumake[5]: *** [makesdna] Error 1
gnumake[5]: Target `all' not remade because of errors.
gnumake[5]: Nothing to be done for `all-am'.
gnumake[4]: *** [all-recursive] Error 1
gnumake[4]: Target `all' not remade because of errors.
Making all in src
gnumake[4]: Nothing to be done for `all'.
Making all in renderconverter
gnumake[4]: Nothing to be done for `all'.
gnumake[4]: *** No rule to make target `imbuf/libblender_imbuf.la', needed by `libblender_blender.la'.
gnumake[4]: Target `all-am' not remade because of errors.
gnumake[3]: *** [all-recursive] Error 1
gnumake[3]: Target `all' not remade because of errors.
Making all in kernel
gnumake[3]: Nothing to be done for `all'.
Making all in creator
gnumake[3]: Nothing to be done for `all'.
gnumake[3]: *** No rule to make target `blender/libblender_blender.la', needed by `libblender_source.la'.
gnumake[3]: Target `all-am' not remade because of errors.
gnumake[2]: *** [all-recursive] Error 1
gnumake[2]: Target `all' not remade because of errors.
gnumake[2]: *** No rule to make target `source/libblender_source.la', needed by `blender.app'.
gnumake[2]: *** No rule to make target `intern/libblender_intern.la', needed by `blender.app'.
gnumake[2]: Target `all-am' not remade because of errors.
gnumake[1]: *** [all-recursive] Error 1
gnumake: *** [all] Error 2

I have commented the LIB -lGLU line out in makesdna/intern/Makefile.
Reply with quote


lholt

Posted: Fri Dec 27, 2002 7:22 pm
Joined: 29 Oct 2002
Posts: 18
I get sort of the same thing now on slackware linux:
-------
gcc -g -O2 -o makesdna makesdna-makesdna.o ../../../../intern/guardedalloc/.libs/libblender_guardedalloc.al -lXxf86dga -lGLU -lGL -lX11 -lXext -lutil -lm /usr/local/lib/libjpeg.so -lpng -lcrypto -lssl -lpthread -ldl -lstdc++ -lz -Wl,--rpath -Wl,/usr/local/lib -Wl,--rpath -Wl,/usr/local/lib
/usr/i386-slackware-linux/bin/ld: cannot find -lX11
collect2: ld returned 1 exit status
-------

Strange. It's almost the same type of error I get with the new gcc 3.2. on Slackware 9.0, Collect2 that is.
Bottom line. Slackware 8.0 won't compile today, I messed with the Xlib in the Make file but no good.
Make files are still a mystery to me. Lots of other folks too, it seems.

X_LIBS = -L/usr/X11R6/lib -L/usr/X11R6/lib is in the Makefile. Twice no less.
Reply with quote


 
Jump to:  
Powered by phpBB © 2001, 2005 phpBB Group