[Update]BF Windows 2006/06/08 + pov and Yafray windows

User-contributed CVS development builds. Please test and give feedback!

Moderators: jesterKing, stiv

Post Reply
lguillaume
Posts: 0
Joined: Tue Jan 04, 2005 10:25 pm

[Update]BF Windows 2006/06/08 + pov and Yafray windows

Post by lguillaume »

Hello new compilation :
- My patch to allow win98 user to avoid a crash at loading and have the 2 directory desktop and My Documents in the fileselector
- Patch from RCRuiz to render in pov. Please try and put your feedback on patch tracker or in this thread, I wil send all bug found to RCRuiz.

Downloads :

blender windows compressed with 7zip (2.3MB)
blender windows compressed with zip (3.2MB)

Yafray windows compressed with 7zip(478.7 KB)
Yafray windows compressed with zip(914.8 KB KB)
Last edited by lguillaume on Wed Jun 14, 2006 9:55 am, edited 3 times in total.

aligorith
Posts: 0
Joined: Sun Dec 05, 2004 3:40 am
Location: Chch, NZ

Post by aligorith »

lguillaume, slightly off-topic, but:

I'm getting this sort of garbage everytime I try to compile with Scons + Mingw. Any ideas?

Compiling ==> 'radrender.c'
source\blender\radiosity\intern\source\radrender.c:87: error: syntax error before '*' toke
n
source\blender\radiosity\intern\source\radrender.c: In function `findshoot_rr':
source\blender\radiosity\intern\source\radrender.c:97: error: `re' undeclared (first use i
n this function)
source\blender\radiosity\intern\source\radrender.c:97: error: (Each undeclared identifier
is reported only once
source\blender\radiosity\intern\source\radrender.c:97: error: for each function it appears
in.)
source\blender\radiosity\intern\source\radrender.c:116: error: incompatible types in retur
n
source\blender\radiosity\intern\source\radrender.c:120: error: incompatible types in retur
n
source\blender\radiosity\intern\source\radrender.c: At top level:
source\blender\radiosity\intern\source\radrender.c:123: error: syntax error before '*' tok
en
source\blender\radiosity\intern\source\radrender.c: In function `backface_test_rr':
source\blender\radiosity\intern\source\radrender.c:131: error: `re' undeclared (first use
in this function)
source\blender\radiosity\intern\source\radrender.c:134: error: `shoot' undeclared (first u
se in this function)
source\blender\radiosity\intern\source\radrender.c: At top level:
source\blender\radiosity\intern\source\radrender.c:146: error: syntax error before '*' tok
en
source\blender\radiosity\intern\source\radrender.c: In function `clear_backface_test_rr':
source\blender\radiosity\intern\source\radrender.c:153: error: `re' undeclared (first use
in this function)
source\blender\radiosity\intern\source\radrender.c: At top level:
source\blender\radiosity\intern\source\radrender.c:166: error: syntax error before '*' tok
en
source\blender\radiosity\intern\source\radrender.c: In function `makeformfactors_rr':
source\blender\radiosity\intern\source\radrender.c:178: error: `shoot' undeclared (first u
se in this function)
source\blender\radiosity\intern\source\radrender.c:210: error: `re' undeclared (first use
in this function)
source\blender\radiosity\intern\source\radrender.c: At top level:
source\blender\radiosity\intern\source\radrender.c:225: error: syntax error before '*' tok
en
source\blender\radiosity\intern\source\radrender.c: In function `applyformfactors_rr':
source\blender\radiosity\intern\source\radrender.c:232: error: `shoot' undeclared (first u
se in this function)
source\blender\radiosity\intern\source\radrender.c:238: error: `re' undeclared (first use
in this function)
source\blender\radiosity\intern\source\radrender.c: At top level:
source\blender\radiosity\intern\source\radrender.c:270: error: syntax error before '*' tok
en
source\blender\radiosity\intern\source\radrender.c: In function `progressiverad_rr':
source\blender\radiosity\intern\source\radrender.c:276: error: `re' undeclared (first use
in this function)
source\blender\radiosity\intern\source\radrender.c:276: error: incompatible types in assig
nment
source\blender\radiosity\intern\source\radrender.c:305: error: incompatible types in assig
nment
source\blender\radiosity\intern\source\radrender.c: At top level:
source\blender\radiosity\intern\source\radrender.c:314: error: syntax error before '*' tok
en
source\blender\radiosity\intern\source\radrender.c: In function `initradfaces':
source\blender\radiosity\intern\source\radrender.c:329: error: `re' undeclared (first use
in this function)
source\blender\radiosity\intern\source\radrender.c: At top level:
source\blender\radiosity\intern\source\radrender.c:409: error: syntax error before '*' tok
en
source\blender\radiosity\intern\source\radrender.c: In function `make_vertex_rad_values':
source\blender\radiosity\intern\source\radrender.c:421: error: `re' undeclared (first use
in this function)
source\blender\radiosity\intern\source\radrender.c: At top level:
source\blender\radiosity\intern\source\radrender.c:471: error: syntax error before '*' tok
en
source\blender\radiosity\intern\source\radrender.c: In function `do_radio_render':
source\blender\radiosity\intern\source\radrender.c:472: error: number of arguments doesn't
match prototype
source/blender/radiosity/extern/include/radio.h:170: error: prototype declaration
source\blender\radiosity\intern\source\radrender.c:477: error: `re' undeclared (first use
in this function)
scons: *** [C:\blenderdev\build\win32-mingw\source\blender\radiosity\intern\source\radrend
er.o] Error 1

Aligorith

lguillaume
Posts: 0
Joined: Tue Jan 04, 2005 10:25 pm

Post by lguillaume »

Aligorith I would like tou help you but I compile with MSVC, and I'm not a coder, I can found very easy bug but that's all. I will look to it but not today.

Post Reply