Error in do_matbuts when compiling.:

Compiling, libraries, modules, coding guidelines and porting

Moderators: jesterKing, stiv

Post Reply
M-M
Posts: 8
Joined: Wed Oct 16, 2002 1:08 am

Error in do_matbuts when compiling.:

Post by M-M » Fri Nov 28, 2003 12:30 am

Hello,
I've an error when compiling the lastest cvs ( Linux Red Hat 9.0 ). What can i do?
Thanks

------------------------------
../../../../source/blender/src/buttons_shading.c: In function `do_matbuts':
../../../../source/blender/src/buttons_shading.c:1949: `B_MATHALO' undeclared (first use in this function)
../../../../source/blender/src/buttons_shading.c:1949: (Each undeclared identifier is reported only once
../../../../source/blender/src/buttons_shading.c:1949: for each function it appears in.)
../../../../source/blender/src/buttons_shading.c: In function `material_panel_shading':
../../../../source/blender/src/buttons_shading.c:2217: `B_MATHALO' undeclared (first use in this function)
gmake[4]: *** [libblender_blendersrc_la-buttons_shading.lo] Erreur 1
gmake[4]: Quitte le répertoire `/usr/local/blender_cvs/blender/build/source/blender/src'
gmake[3]: *** [all-recursive] Erreur 1
gmake[3]: Quitte le répertoire `/usr/local/blender_cvs/blender/build/source/blender'
gmake[2]: *** [all-recursive] Erreur 1
gmake[2]: Quitte le répertoire `/usr/local/blender_cvs/blender/build/source'
gmake[1]: *** [all-recursive] Erreur 1
gmake[1]: Quitte le répertoire `/usr/local/blender_cvs/blender/build'
make: *** [all] Erreur 2
------------------------------

M-M
Posts: 8
Joined: Wed Oct 16, 2002 1:08 am

Work's fine now....

Post by M-M » Fri Nov 28, 2003 1:12 am

Just find a new update and work's fine now.

theeth
Posts: 500
Joined: Wed Oct 16, 2002 5:47 am
Location: Montreal
Contact:

Post by theeth » Fri Nov 28, 2003 2:23 am

Blame Ton for not commiting correctly :P

Martin
Life is what happens to you when you're busy making other plans.
- John Lennon

Post Reply