Page 1 of 1

Error in do_matbuts when compiling.:

Posted: Fri Nov 28, 2003 12:30 am
by M-M
Hello,
I've an error when compiling the lastest cvs ( Linux Red Hat 9.0 ). What can i do?
Thanks

------------------------------
../../../../source/blender/src/buttons_shading.c: In function `do_matbuts':
../../../../source/blender/src/buttons_shading.c:1949: `B_MATHALO' undeclared (first use in this function)
../../../../source/blender/src/buttons_shading.c:1949: (Each undeclared identifier is reported only once
../../../../source/blender/src/buttons_shading.c:1949: for each function it appears in.)
../../../../source/blender/src/buttons_shading.c: In function `material_panel_shading':
../../../../source/blender/src/buttons_shading.c:2217: `B_MATHALO' undeclared (first use in this function)
gmake[4]: *** [libblender_blendersrc_la-buttons_shading.lo] Erreur 1
gmake[4]: Quitte le répertoire `/usr/local/blender_cvs/blender/build/source/blender/src'
gmake[3]: *** [all-recursive] Erreur 1
gmake[3]: Quitte le répertoire `/usr/local/blender_cvs/blender/build/source/blender'
gmake[2]: *** [all-recursive] Erreur 1
gmake[2]: Quitte le répertoire `/usr/local/blender_cvs/blender/build/source'
gmake[1]: *** [all-recursive] Erreur 1
gmake[1]: Quitte le répertoire `/usr/local/blender_cvs/blender/build'
make: *** [all] Erreur 2
------------------------------

Work's fine now....

Posted: Fri Nov 28, 2003 1:12 am
by M-M
Just find a new update and work's fine now.

Posted: Fri Nov 28, 2003 2:23 am
by theeth
Blame Ton for not commiting correctly :P

Martin