Page 1 of 2

Latest linux CVS compile (20/10/05) error

Posted: Sun Oct 23, 2005 11:31 pm
by Napoleon
Just decided to build the latetes cvs build and i get this error:

source/gameengine/Ketsji/KX_TouchSensor.cpp:298: warning: unused parameter 'args'
source/gameengine/Ketsji/KX_TouchSensor.cpp:298: warning: unused parameter 'kwds'
source/gameengine/Ketsji/KX_TouchSensor.cpp:315: warning: unused parameter 'self'
source/gameengine/Ketsji/KX_TouchSensor.cpp:315: warning: unused parameter 'args'
source/gameengine/Ketsji/KX_TouchSensor.cpp:315: warning: unused parameter 'kwds'
source/gameengine/Ketsji/KX_TouchSensor.cpp:369: warning: unused parameter 'self'
source/gameengine/Ketsji/KX_TouchSensor.cpp:369: warning: unused parameter 'args'
source/gameengine/Ketsji/KX_TouchSensor.cpp:369: warning: unused parameter 'kwds'
source/gameengine/Ketsji/KX_TouchSensor.cpp:380: warning: unused parameter 'self'
source/gameengine/Ketsji/KX_TouchSensor.cpp:380: warning: unused parameter 'kwds'
scons: *** [/home/napoleon/blenderdev/build/linux2/source/gameengine/Ketsji/KX_TouchSensor.o] Error 1
scons: building terminated because of errors.

Thanks and have a good day

Posted: Mon Oct 24, 2005 8:17 am
by jesterKing
These are warnings, not errors. Please scroll up in your output, and search for the *first* error that is encountered.

/Nathan

Posted: Mon Oct 24, 2005 7:51 pm
by Napoleon
Please below is all the messages i could get. I hope it helps.

===========================================================================
In file included from /usr/include/python2.4/Python.h:8,
from source/gameengine/Expressions/KX_Python.h:36,
from source/gameengine/Expressions/PyObjectPlus.h:42,
from source/gameengine/Expressions/Value.h:188,
from source/gameengine/GameLogic/SCA_ILogicBrick.h:35,
from source/gameengine/GameLogic/SCA_IActuator.h:35,
from source/gameengine/Ketsji/KX_VisibilityActuator.h:37,
from source/gameengine/Ketsji/KX_VisibilityActuator.cpp:34:
/usr/include/python2.4/pyconfig.h:835:1: warning: "_POSIX_C_SOURCE" redefined
In file included from /usr/lib/gcc/i686-pc-linux-gnu/4.0.3/../../../../include/c++/4.0.3/i686-pc-linux-gnu/bits/os_defines.h:39,
from /usr/lib/gcc/i686-pc-linux-gnu/4.0.3/../../../../include/c++/4.0.3/i686-pc-linux-gnu/bits/c++config.h:35,
from /usr/lib/gcc/i686-pc-linux-gnu/4.0.3/../../../../include/c++/4.0.3/bits/stl_algobase.h:64,
from /usr/lib/gcc/i686-pc-linux-gnu/4.0.3/../../../../include/c++/4.0.3/bits/stl_tree.h:66,
from /usr/lib/gcc/i686-pc-linux-gnu/4.0.3/../../../../include/c++/4.0.3/map:65,
from source/gameengine/Expressions/Value.h:42,
from source/gameengine/GameLogic/SCA_ILogicBrick.h:35,
from source/gameengine/GameLogic/SCA_IActuator.h:35,
from source/gameengine/Ketsji/KX_VisibilityActuator.h:37,
from source/gameengine/Ketsji/KX_VisibilityActuator.cpp:34:
/usr/include/features.h:150:1: warning: this is the location of the previous definition
In file included from /usr/include/python2.4/Python.h:8,
from source/gameengine/Expressions/KX_Python.h:36,
from source/gameengine/Expressions/PyObjectPlus.h:42,
from source/gameengine/Expressions/Value.h:188,
from source/gameengine/GameLogic/SCA_IObject.h:39,
from source/gameengine/Ketsji/KX_VertexProxy.h:35,
from source/gameengine/Ketsji/KX_VertexProxy.cpp:36:
/usr/include/python2.4/pyconfig.h:835:1: warning: "_POSIX_C_SOURCE" redefined
In file included from /usr/lib/gcc/i686-pc-linux-gnu/4.0.3/../../../../include/c++/4.0.3/i686-pc-linux-gnu/bits/os_defines.h:39,
from /usr/lib/gcc/i686-pc-linux-gnu/4.0.3/../../../../include/c++/4.0.3/i686-pc-linux-gnu/bits/c++config.h:35,
from /usr/lib/gcc/i686-pc-linux-gnu/4.0.3/../../../../include/c++/4.0.3/bits/stl_algobase.h:64,
from /usr/lib/gcc/i686-pc-linux-gnu/4.0.3/../../../../include/c++/4.0.3/bits/stl_tree.h:66,
from /usr/lib/gcc/i686-pc-linux-gnu/4.0.3/../../../../include/c++/4.0.3/map:65,
from source/gameengine/Expressions/Value.h:42,
from source/gameengine/GameLogic/SCA_IObject.h:39,
from source/gameengine/Ketsji/KX_VertexProxy.h:35,
from source/gameengine/Ketsji/KX_VertexProxy.cpp:36:
/usr/include/features.h:150:1: warning: this is the location of the previous definition
source/gameengine/Expressions/PyObjectPlus.h:67: warning: unused parameter 'M'
source/gameengine/Expressions/PyObjectPlus.h:179: warning: unused parameter 'kwd'
source/gameengine/Expressions/PyObjectPlus.h:67: warning: unused parameter 'M'
source/gameengine/Expressions/PyObjectPlus.h:179: warning: unused parameter 'kwd'
source/gameengine/Ketsji/KX_VisibilityActuator.cpp:112: warning: missing initializer for member '_typeobject::tp_str'
source/gameengine/Ketsji/KX_VisibilityActuator.cpp:112: warning: missing initializer for member '_typeobject::tp_getattro'
source/gameengine/Ketsji/KX_VisibilityActuator.cpp:112: warning: missing initializer for member '_typeobject::tp_setattro'
source/gameengine/Ketsji/KX_VisibilityActuator.cpp:112: warning: missing initializer for member '_typeobject::tp_as_buffer'
source/gameengine/Ketsji/KX_VisibilityActuator.cpp:112: warning: missing initializer for member '_typeobject::tp_flags'
source/gameengine/Ketsji/KX_VisibilityActuator.cpp:112: warning: missing initializer for member '_typeobject::tp_doc'
source/gameengine/Ketsji/KX_VisibilityActuator.cpp:112: warning: missing initializer for member '_typeobject::tp_traverse'
source/gameengine/Ketsji/KX_VisibilityActuator.cpp:112: warning: missing initializer for member '_typeobject::tp_clear'
source/gameengine/Ketsji/KX_VisibilityActuator.cpp:112: warning: missing initializer for member '_typeobject::tp_richcompare'
source/gameengine/Ketsji/KX_VisibilityActuator.cpp:112: warning: missing initializer for member '_typeobject::tp_weaklistoffset'
source/gameengine/Ketsji/KX_VisibilityActuator.cpp:112: warning: missing initializer for member '_typeobject::tp_iter'
source/gameengine/Ketsji/KX_VisibilityActuator.cpp:112: warning: missing initializer for member '_typeobject::tp_iternext'
source/gameengine/Ketsji/KX_VisibilityActuator.cpp:112: warning: missing initializer for member '_typeobject::tp_methods'
source/gameengine/Ketsji/KX_VisibilityActuator.cpp:112: warning: missing initializer for member '_typeobject::tp_members'
source/gameengine/Ketsji/KX_VisibilityActuator.cpp:112: warning: missing initializer for member '_typeobject::tp_getset'
source/gameengine/Ketsji/KX_VisibilityActuator.cpp:112: warning: missing initializer for member '_typeobject::tp_base'
source/gameengine/Ketsji/KX_VisibilityActuator.cpp:112: warning: missing initializer for member '_typeobject::tp_dict'
source/gameengine/Ketsji/KX_VisibilityActuator.cpp:112: warning: missing initializer for member '_typeobject::tp_descr_get'
source/gameengine/Ketsji/KX_VisibilityActuator.cpp:112: warning: missing initializer for member '_typeobject::tp_descr_set'
source/gameengine/Ketsji/KX_VisibilityActuator.cpp:112: warning: missing initializer for member '_typeobject::tp_dictoffset'
source/gameengine/Ketsji/KX_VisibilityActuator.cpp:112: warning: missing initializer for member '_typeobject::tp_init'
source/gameengine/Ketsji/KX_VisibilityActuator.cpp:112: warning: missing initializer for member '_typeobject::tp_alloc'
source/gameengine/Ketsji/KX_VisibilityActuator.cpp:112: warning: missing initializer for member '_typeobject::tp_new'
source/gameengine/Ketsji/KX_VisibilityActuator.cpp:112: warning: missing initializer for member '_typeobject::tp_free'
source/gameengine/Ketsji/KX_VisibilityActuator.cpp:112: warning: missing initializer for member '_typeobject::tp_is_gc'
source/gameengine/Ketsji/KX_VisibilityActuator.cpp:112: warning: missing initializer for member '_typeobject::tp_bases'
source/gameengine/Ketsji/KX_VisibilityActuator.cpp:112: warning: missing initializer for member '_typeobject::tp_mro'
source/gameengine/Ketsji/KX_VisibilityActuator.cpp:112: warning: missing initializer for member '_typeobject::tp_cache'
source/gameengine/Ketsji/KX_VisibilityActuator.cpp:112: warning: missing initializer for member '_typeobject::tp_subclasses'
source/gameengine/Ketsji/KX_VisibilityActuator.cpp:112: warning: missing initializer for member '_typeobject::tp_weaklist'
source/gameengine/Ketsji/KX_VisibilityActuator.cpp:112: warning: missing initializer for member '_typeobject::tp_del'
source/gameengine/Ketsji/KX_VisibilityActuator.cpp:128: warning: missing initializer for member 'PyMethodDef::ml_flags'
source/gameengine/Ketsji/KX_VisibilityActuator.cpp:128: warning: missing initializer for member 'PyMethodDef::ml_doc'
source/gameengine/Ketsji/KX_VisibilityActuator.cpp:150: warning: unused parameter 'self'
source/gameengine/Ketsji/KX_VisibilityActuator.cpp:150: warning: unused parameter 'kwds'
source/gameengine/Ketsji/KX_VertexProxy.cpp:59: warning: missing initializer for member '_typeobject::tp_str'
source/gameengine/Ketsji/KX_VertexProxy.cpp:59: warning: missing initializer for member '_typeobject::tp_getattro'
source/gameengine/Ketsji/KX_VertexProxy.cpp:59: warning: missing initializer for member '_typeobject::tp_setattro'
source/gameengine/Ketsji/KX_VertexProxy.cpp:59: warning: missing initializer for member '_typeobject::tp_as_buffer'
source/gameengine/Ketsji/KX_VertexProxy.cpp:59: warning: missing initializer for member '_typeobject::tp_flags'
source/gameengine/Ketsji/KX_VertexProxy.cpp:59: warning: missing initializer for member '_typeobject::tp_doc'
source/gameengine/Ketsji/KX_VertexProxy.cpp:59: warning: missing initializer for member '_typeobject::tp_traverse'
source/gameengine/Ketsji/KX_VertexProxy.cpp:59: warning: missing initializer for member '_typeobject::tp_clear'
source/gameengine/Ketsji/KX_VertexProxy.cpp:59: warning: missing initializer for member '_typeobject::tp_richcompare'
source/gameengine/Ketsji/KX_VertexProxy.cpp:59: warning: missing initializer for member '_typeobject::tp_weaklistoffset'
source/gameengine/Ketsji/KX_VertexProxy.cpp:59: warning: missing initializer for member '_typeobject::tp_iter'
source/gameengine/Ketsji/KX_VertexProxy.cpp:59: warning: missing initializer for member '_typeobject::tp_iternext'
source/gameengine/Ketsji/KX_VertexProxy.cpp:59: warning: missing initializer for member '_typeobject::tp_methods'
source/gameengine/Ketsji/KX_VertexProxy.cpp:59: warning: missing initializer for member '_typeobject::tp_members'
source/gameengine/Ketsji/KX_VertexProxy.cpp:59: warning: missing initializer for member '_typeobject::tp_getset'
source/gameengine/Ketsji/KX_VertexProxy.cpp:59: warning: missing initializer for member '_typeobject::tp_base'
source/gameengine/Ketsji/KX_VertexProxy.cpp:59: warning: missing initializer for member '_typeobject::tp_dict'
source/gameengine/Ketsji/KX_VertexProxy.cpp:59: warning: missing initializer for member '_typeobject::tp_descr_get'
source/gameengine/Ketsji/KX_VertexProxy.cpp:59: warning: missing initializer for member '_typeobject::tp_descr_set'
source/gameengine/Ketsji/KX_VertexProxy.cpp:59: warning: missing initializer for member '_typeobject::tp_dictoffset'
source/gameengine/Ketsji/KX_VertexProxy.cpp:59: warning: missing initializer for member '_typeobject::tp_init'
source/gameengine/Ketsji/KX_VertexProxy.cpp:59: warning: missing initializer for member '_typeobject::tp_alloc'
source/gameengine/Ketsji/KX_VertexProxy.cpp:59: warning: missing initializer for member '_typeobject::tp_new'
source/gameengine/Ketsji/KX_VertexProxy.cpp:59: warning: missing initializer for member '_typeobject::tp_free'
source/gameengine/Ketsji/KX_VertexProxy.cpp:59: warning: missing initializer for member '_typeobject::tp_is_gc'
source/gameengine/Ketsji/KX_VertexProxy.cpp:59: warning: missing initializer for member '_typeobject::tp_bases'
source/gameengine/Ketsji/KX_VertexProxy.cpp:59: warning: missing initializer for member '_typeobject::tp_mro'
source/gameengine/Ketsji/KX_VertexProxy.cpp:59: warning: missing initializer for member '_typeobject::tp_cache'
source/gameengine/Ketsji/KX_VertexProxy.cpp:59: warning: missing initializer for member '_typeobject::tp_subclasses'
source/gameengine/Ketsji/KX_VertexProxy.cpp:59: warning: missing initializer for member '_typeobject::tp_weaklist'
source/gameengine/Ketsji/KX_VertexProxy.cpp:59: warning: missing initializer for member '_typeobject::tp_del'
source/gameengine/Ketsji/KX_VertexProxy.cpp:78: warning: missing initializer for member 'PyMethodDef::ml_doc'
source/gameengine/Ketsji/KX_VertexProxy.cpp:78: warning: missing initializer for member 'PyMethodDef::ml_doc'
source/gameengine/Ketsji/KX_VertexProxy.cpp:78: warning: missing initializer for member 'PyMethodDef::ml_doc'
source/gameengine/Ketsji/KX_VertexProxy.cpp:78: warning: missing initializer for member 'PyMethodDef::ml_doc'
source/gameengine/Ketsji/KX_VertexProxy.cpp:78: warning: missing initializer for member 'PyMethodDef::ml_doc'
source/gameengine/Ketsji/KX_VertexProxy.cpp:78: warning: missing initializer for member 'PyMethodDef::ml_doc'
source/gameengine/Ketsji/KX_VertexProxy.cpp:78: warning: missing initializer for member 'PyMethodDef::ml_doc'
source/gameengine/Ketsji/KX_VertexProxy.cpp:78: warning: missing initializer for member 'PyMethodDef::ml_doc'
source/gameengine/Ketsji/KX_VertexProxy.cpp:78: warning: missing initializer for member 'PyMethodDef::ml_flags'
source/gameengine/Ketsji/KX_VertexProxy.cpp:78: warning: missing initializer for member 'PyMethodDef::ml_doc'
In file included from /usr/include/python2.4/Python.h:8,
from source/gameengine/Expressions/KX_Python.h:36,
from source/gameengine/Expressions/PyObjectPlus.h:42,
from source/gameengine/Expressions/Value.h:188,
from source/gameengine/GameLogic/SCA_ILogicBrick.h:35,
from source/gameengine/GameLogic/SCA_IActuator.h:35,
from source/gameengine/Ketsji/KX_TrackToActuator.cpp:40:
/usr/include/python2.4/pyconfig.h:835:1: warning: "_POSIX_C_SOURCE" redefined
In file included from /usr/include/math.h:27,
from intern/moto/include/MT_Scalar.h:49,
from source/gameengine/Ketsji/KX_TrackToActuator.cpp:39:
/usr/include/features.h:150:1: warning: this is the location of the previous definition
source/gameengine/Expressions/PyObjectPlus.h:67: warning: unused parameter 'M'
source/gameengine/Expressions/PyObjectPlus.h:179: warning: unused parameter 'kwd'
source/gameengine/Ketsji/KX_TrackToActuator.cpp:177: warning: unused parameter 'curtime'
source/gameengine/Ketsji/KX_TrackToActuator.cpp:177: warning: unused parameter 'frame'
source/gameengine/Ketsji/KX_TrackToActuator.cpp:362: warning: missing initializer for member '_typeobject::tp_str'
source/gameengine/Ketsji/KX_TrackToActuator.cpp:362: warning: missing initializer for member '_typeobject::tp_getattro'
source/gameengine/Ketsji/KX_TrackToActuator.cpp:362: warning: missing initializer for member '_typeobject::tp_setattro'
source/gameengine/Ketsji/KX_TrackToActuator.cpp:362: warning: missing initializer for member '_typeobject::tp_as_buffer'
source/gameengine/Ketsji/KX_TrackToActuator.cpp:362: warning: missing initializer for member '_typeobject::tp_flags'
source/gameengine/Ketsji/KX_TrackToActuator.cpp:362: warning: missing initializer for member '_typeobject::tp_doc'
source/gameengine/Ketsji/KX_TrackToActuator.cpp:362: warning: missing initializer for member '_typeobject::tp_traverse'
source/gameengine/Ketsji/KX_TrackToActuator.cpp:362: warning: missing initializer for member '_typeobject::tp_clear'
source/gameengine/Ketsji/KX_TrackToActuator.cpp:362: warning: missing initializer for member '_typeobject::tp_richcompare'
source/gameengine/Ketsji/KX_TrackToActuator.cpp:362: warning: missing initializer for member '_typeobject::tp_weaklistoffset'
source/gameengine/Ketsji/KX_TrackToActuator.cpp:362: warning: missing initializer for member '_typeobject::tp_iter'
source/gameengine/Ketsji/KX_TrackToActuator.cpp:362: warning: missing initializer for member '_typeobject::tp_iternext'
source/gameengine/Ketsji/KX_TrackToActuator.cpp:362: warning: missing initializer for member '_typeobject::tp_methods'
source/gameengine/Ketsji/KX_TrackToActuator.cpp:362: warning: missing initializer for member '_typeobject::tp_members'
source/gameengine/Ketsji/KX_TrackToActuator.cpp:362: warning: missing initializer for member '_typeobject::tp_getset'
source/gameengine/Ketsji/KX_TrackToActuator.cpp:362: warning: missing initializer for member '_typeobject::tp_base'
source/gameengine/Ketsji/KX_TrackToActuator.cpp:362: warning: missing initializer for member '_typeobject::tp_dict'In file included from /usr/include/python2.4/Python.h:8,
from source/gameengine/Expressions/KX_Python.h:36,
from source/gameengine/Expressions/PyObjectPlus.h:42,
from source/gameengine/Expressions/Value.h:188,
from source/gameengine/GameLogic/SCA_ILogicBrick.h:35,
from source/gameengine/GameLogic/SCA_ISensor.h:38,
from source/gameengine/Ketsji/KX_TouchSensor.h:38,
from source/gameengine/Ketsji/KX_TouchSensor.cpp:35:
/usr/include/python2.4/pyconfig.h:835:1: warning: "_POSIX_C_SOURCE" redefined
In file included from /usr/lib/gcc/i686-pc-linux-gnu/4.0.3/../../../../include/c++/4.0.3/i686-pc-linux-gnu/bits/os_defines.h:39,
from /usr/lib/gcc/i686-pc-linux-gnu/4.0.3/../../../../include/c++/4.0.3/i686-pc-linux-gnu/bits/c++config.h:35,
from /usr/lib/gcc/i686-pc-linux-gnu/4.0.3/../../../../include/c++/4.0.3/bits/stl_algobase.h:64,
from /usr/lib/gcc/i686-pc-linux-gnu/4.0.3/../../../../include/c++/4.0.3/bits/stl_tree.h:66,
from /usr/lib/gcc/i686-pc-linux-gnu/4.0.3/../../../../include/c++/4.0.3/map:65,
from source/gameengine/Expressions/Value.h:42,
from source/gameengine/GameLogic/SCA_ILogicBrick.h:35,
from source/gameengine/GameLogic/SCA_ISensor.h:38,
from source/gameengine/Ketsji/KX_TouchSensor.h:38,
from source/gameengine/Ketsji/KX_TouchSensor.cpp:35:
/usr/include/features.h:150:1: warning: this is the location of the previous definition

source/gameengine/Ketsji/KX_TrackToActuator.cpp:362: warning: missing initializer for member '_typeobject::tp_descr_get'
source/gameengine/Ketsji/KX_TrackToActuator.cpp:362: warning: missing initializer for member '_typeobject::tp_descr_set'
source/gameengine/Ketsji/KX_TrackToActuator.cpp:362: warning: missing initializer for member '_typeobject::tp_dictoffset'
source/gameengine/Ketsji/KX_TrackToActuator.cpp:362: warning: missing initializer for member '_typeobject::tp_init'
source/gameengine/Ketsji/KX_TrackToActuator.cpp:362: warning: missing initializer for member '_typeobject::tp_alloc'
source/gameengine/Ketsji/KX_TrackToActuator.cpp:362: warning: missing initializer for member '_typeobject::tp_new'
source/gameengine/Ketsji/KX_TrackToActuator.cpp:362: warning: missing initializer for member '_typeobject::tp_free'
source/gameengine/Ketsji/KX_TrackToActuator.cpp:362: warning: missing initializer for member '_typeobject::tp_is_gc'
source/gameengine/Ketsji/KX_TrackToActuator.cpp:362: warning: missing initializer for member '_typeobject::tp_bases'
source/gameengine/Ketsji/KX_TrackToActuator.cpp:362: warning: missing initializer for member '_typeobject::tp_mro'
source/gameengine/Ketsji/KX_TrackToActuator.cpp:362: warning: missing initializer for member '_typeobject::tp_cache'
source/gameengine/Ketsji/KX_TrackToActuator.cpp:362: warning: missing initializer for member '_typeobject::tp_subclasses'
source/gameengine/Ketsji/KX_TrackToActuator.cpp:362: warning: missing initializer for member '_typeobject::tp_weaklist'
source/gameengine/Ketsji/KX_TrackToActuator.cpp:362: warning: missing initializer for member '_typeobject::tp_del'
source/gameengine/Ketsji/KX_TrackToActuator.cpp:384: warning: missing initializer for member 'PyMethodDef::ml_flags'
source/gameengine/Ketsji/KX_TrackToActuator.cpp:384: warning: missing initializer for member 'PyMethodDef::ml_doc'
source/gameengine/Ketsji/KX_TrackToActuator.cpp:400: warning: unused parameter 'self'
source/gameengine/Ketsji/KX_TrackToActuator.cpp:400: warning: unused parameter 'kwds'
source/gameengine/Ketsji/KX_TrackToActuator.cpp:427: warning: unused parameter 'self'
source/gameengine/Ketsji/KX_TrackToActuator.cpp:427: warning: unused parameter 'args'
source/gameengine/Ketsji/KX_TrackToActuator.cpp:427: warning: unused parameter 'kwds'
source/gameengine/Ketsji/KX_TrackToActuator.cpp:442: warning: unused parameter 'self'
source/gameengine/Ketsji/KX_TrackToActuator.cpp:442: warning: unused parameter 'kwds'
source/gameengine/Ketsji/KX_TrackToActuator.cpp:463: warning: unused parameter 'self'
source/gameengine/Ketsji/KX_TrackToActuator.cpp:463: warning: unused parameter 'args'
source/gameengine/Ketsji/KX_TrackToActuator.cpp:463: warning: unused parameter 'kwds'
source/gameengine/Ketsji/KX_TrackToActuator.cpp:474: warning: unused parameter 'self'
source/gameengine/Ketsji/KX_TrackToActuator.cpp:474: warning: unused parameter 'args'
source/gameengine/Ketsji/KX_TrackToActuator.cpp:474: warning: unused parameter 'kwds'
source/gameengine/Ketsji/KX_TrackToActuator.cpp:487: warning: unused parameter 'self'
source/gameengine/Ketsji/KX_TrackToActuator.cpp:487: warning: unused parameter 'kwds'
In file included from source/gameengine/Ketsji/KX_ClientObjectInfo.h:35,
from source/gameengine/Ketsji/KX_TouchSensor.h:43,
from source/gameengine/Ketsji/KX_TouchSensor.cpp:35:
source/gameengine/Physics/Sumo/Fuzzics/include/SM_Object.h:37:25: error: SOLID/SOLID.h: No such file or directory
source/gameengine/Expressions/PyObjectPlus.h:67: warning: unused parameter 'M'
source/gameengine/Expressions/PyObjectPlus.h:179: warning: unused parameter 'kwd'
source/gameengine/Physics/Sumo/Fuzzics/include/SM_Callback.h:4: warning: 'class SM_Callback' has virtual functions but non-virtual destructor
source/gameengine/Physics/Sumo/Fuzzics/include/SM_MotionState.h:37: warning: 'class SM_MotionState' has virtual functions but non-virtual destructor
source/gameengine/Physics/Sumo/Fuzzics/include/SM_Object.h:89: error: expected `)' before 'shape'
source/gameengine/Physics/Sumo/Fuzzics/include/SM_Object.h:233: error: 'DT_ObjectHandle' does not name a type
source/gameengine/Physics/Sumo/Fuzzics/include/SM_Object.h:234: error: 'DT_ShapeHandle' does not name a type
source/gameengine/Physics/Sumo/Fuzzics/include/SM_Object.h:247: error: 'DT_Bool' does not name a type
source/gameengine/Physics/Sumo/Fuzzics/include/SM_Object.h:256: error: 'DT_Bool' does not name a type
source/gameengine/Physics/Sumo/Fuzzics/include/SM_Object.h:337: error: 'DT_ShapeHandle' does not name a type
source/gameengine/Physics/Sumo/Fuzzics/include/SM_Object.h:345: error: 'DT_ObjectHandle' does not name a type
In file included from /usr/include/python2.4/Python.h:8,
from source/gameengine/Expressions/KX_Python.h:36,
from source/gameengine/Expressions/PyObjectPlus.h:42,
from source/gameengine/Expressions/Value.h:188,
from source/gameengine/GameLogic/SCA_ILogicBrick.h:35,
from source/gameengine/GameLogic/SCA_ISensor.h:38,
from source/gameengine/Ketsji/KX_TouchSensor.h:38,
from source/gameengine/Ketsji/KX_TouchEventManager.h:37,
from source/gameengine/Ketsji/KX_TouchEventManager.cpp:32:
/usr/include/python2.4/pyconfig.h:835:1: warning: "_POSIX_C_SOURCE" redefined
In file included from /usr/lib/gcc/i686-pc-linux-gnu/4.0.3/../../../../include/c++/4.0.3/i686-pc-linux-gnu/bits/os_defines.h:39,
from /usr/lib/gcc/i686-pc-linux-gnu/4.0.3/../../../../include/c++/4.0.3/i686-pc-linux-gnu/bits/c++config.h:35,
from /usr/lib/gcc/i686-pc-linux-gnu/4.0.3/../../../../include/c++/4.0.3/bits/stl_algobase.h:64,
from /usr/lib/gcc/i686-pc-linux-gnu/4.0.3/../../../../include/c++/4.0.3/vector:66,
from source/gameengine/GameLogic/SCA_EventManager.h:35,
from source/gameengine/Ketsji/KX_TouchEventManager.h:36,
from source/gameengine/Ketsji/KX_TouchEventManager.cpp:32:
/usr/include/features.h:150:1: warning: this is the location of the previous definition
In file included from source/gameengine/Ketsji/KX_ClientObjectInfo.h:35,
from source/gameengine/Ketsji/KX_TouchSensor.h:43,
from source/gameengine/Ketsji/KX_TouchEventManager.h:37,
from source/gameengine/Ketsji/KX_TouchEventManager.cpp:32:
source/gameengine/Physics/Sumo/Fuzzics/include/SM_Object.h:37:25: error: SOLID/SOLID.h: No such file or directory
source/gameengine/Physics/Sumo/Fuzzics/include/SM_Scene.h:69: error: 'DT_RespTableHandle' does not name a type
source/gameengine/Physics/Sumo/Fuzzics/include/SM_Scene.h:85: error: 'DT_ResponseCallback' has not been declared
source/gameengine/Physics/Sumo/Fuzzics/include/SM_Scene.h:93: error: 'DT_RespTableHandle' has not been declared
source/gameengine/Physics/Sumo/Fuzzics/include/SM_Scene.h:94: error: 'DT_RespTableHandle' does not name a type
source/gameengine/Physics/Sumo/Fuzzics/include/SM_Scene.h:134: error: 'DT_Bool' does not name a type
source/gameengine/Physics/Sumo/Fuzzics/include/SM_Scene.h:146: error: 'DT_SceneHandle' does not name a type
source/gameengine/Physics/Sumo/Fuzzics/include/SM_Scene.h:148: error: 'DT_RespTableHandle' does not name a type
source/gameengine/Physics/Sumo/Fuzzics/include/SM_Scene.h:149: error: 'DT_ResponseClass' does not name a type
source/gameengine/Physics/Sumo/Fuzzics/include/SM_Scene.h:153: error: 'DT_RespTableHandle' does not name a type
source/gameengine/Physics/Sumo/Fuzzics/include/SM_Scene.h:154: error: 'DT_ResponseClass' does not name a type
source/gameengine/Physics/Sumo/Fuzzics/include/SM_Scene.h:160: error: 'DT_RespTableHandle' does not name a type
source/gameengine/Physics/Sumo/Fuzzics/include/SM_Scene.h:161: error: 'DT_ResponseClass' does not name a type
source/gameengine/Physics/Sumo/SumoPhysicsController.h:90: warning: unused parameter 'active'
source/gameengine/Ketsji/KX_SumoPhysicsController.h:106: warning: unused parameter 'option'
source/gameengine/Ketsji/KX_SumoPhysicsController.h:106: warning: unused parameter 'value'
source/gameengine/Physics/common/PHY_IPhysicsEnvironment.h:55: warning: unused parameter 'debugMode'
source/gameengine/Physics/common/PHY_IPhysicsEnvironment.h:57: warning: unused parameter 'numIter'
source/gameengine/Physics/common/PHY_IPhysicsEnvironment.h:59: warning: unused parameter 'dTime'
source/gameengine/Physics/common/PHY_IPhysicsEnvironment.h:61: warning: unused parameter 'linTresh'
source/gameengine/Physics/common/PHY_IPhysicsEnvironment.h:63: warning: unused parameter 'angTresh'
source/gameengine/Physics/common/PHY_IPhysicsEnvironment.h:65: warning: unused parameter 'contactBreakingTreshold'
source/gameengine/Physics/common/PHY_IPhysicsEnvironment.h:67: warning: unused parameter 'ccdMode'
source/gameengine/Physics/common/PHY_IPhysicsEnvironment.h:69: warning: unused parameter 'sor'
source/gameengine/Physics/common/PHY_IPhysicsEnvironment.h:71: warning: unused parameter 'solverType'
source/gameengine/Physics/common/PHY_IPhysicsEnvironment.h:73: warning: unused parameter 'tau'
source/gameengine/Physics/common/PHY_IPhysicsEnvironment.h:75: warning: unused parameter 'damping'
source/gameengine/Physics/common/PHY_IPhysicsEnvironment.h:77: warning: unused parameter 'damping'
source/gameengine/Physics/common/PHY_IPhysicsEnvironment.h:79: warning: unused parameter 'epa'
source/gameengine/Ketsji/KX_TouchSensor.cpp:72: warning: unused parameter 'event'
source/gameengine/Ketsji/KX_TouchSensor.cpp: In member function 'virtual bool KX_TouchSensor::NewHandleCollision(void*, void*, const PHY_CollData*)':
source/gameengine/Ketsji/KX_TouchSensor.cpp:202: error: 'DT_CONTINUE' was not declared in this scope
source/gameengine/Ketsji/KX_TouchSensor.cpp: At global scope:
source/gameengine/Ketsji/KX_TouchSensor.cpp:160: warning: unused parameter 'colldata'
source/gameengine/Ketsji/KX_TouchSensor.cpp:227: warning: missing initializer for member '_typeobject::tp_str'
source/gameengine/Ketsji/KX_TouchSensor.cpp:227: warning: missing initializer for member '_typeobject::tp_getattro'
source/gameengine/Ketsji/KX_TouchSensor.cpp:227: warning: missing initializer for member '_typeobject::tp_setattro'
source/gameengine/Ketsji/KX_TouchSensor.cpp:227: warning: missing initializer for member '_typeobject::tp_as_buffer'
source/gameengine/Ketsji/KX_TouchSensor.cpp:227: warning: missing initializer for member '_typeobject::tp_flags'
source/gameengine/Ketsji/KX_TouchSensor.cpp:227: warning: missing initializer for member '_typeobject::tp_doc'
source/gameengine/Ketsji/KX_TouchSensor.cpp:227: warning: missing initializer for member '_typeobject::tp_traverse'
source/gameengine/Ketsji/KX_TouchSensor.cpp:227: warning: missing initializer for member '_typeobject::tp_clear'
source/gameengine/Ketsji/KX_TouchSensor.cpp:227: warning: missing initializer for member '_typeobject::tp_richcompare'
source/gameengine/Ketsji/KX_TouchSensor.cpp:227: warning: missing initializer for member '_typeobject::tp_weaklistoffset'
source/gameengine/Ketsji/KX_TouchSensor.cpp:227: warning: missing initializer for member '_typeobject::tp_iter'
source/gameengine/Ketsji/KX_TouchSensor.cpp:227: warning: missing initializer for member '_typeobject::tp_iternext'
source/gameengine/Ketsji/KX_TouchSensor.cpp:227: warning: missing initializer for member '_typeobject::tp_methods'
source/gameengine/Ketsji/KX_TouchSensor.cpp:227: warning: missing initializer for member '_typeobject::tp_members'
source/gameengine/Ketsji/KX_TouchSensor.cpp:227: warning: missing initializer for member '_typeobject::tp_getset'
source/gameengine/Ketsji/KX_TouchSensor.cpp:227: warning: missing initializer for member '_typeobject::tp_base'
source/gameengine/Ketsji/KX_TouchSensor.cpp:227: warning: missing initializer for member '_typeobject::tp_dict'
source/gameengine/Ketsji/KX_TouchSensor.cpp:227: warning: missing initializer for member '_typeobject::tp_descr_get'
source/gameengine/Ketsji/KX_TouchSensor.cpp:227: warning: missing initializer for member '_typeobject::tp_descr_set'
source/gameengine/Ketsji/KX_TouchSensor.cpp:227: warning: missing initializer for member '_typeobject::tp_dictoffset'
source/gameengine/Ketsji/KX_TouchSensor.cpp:227: warning: missing initializer for member '_typeobject::tp_init'
source/gameengine/Ketsji/KX_TouchSensor.cpp:227: warning: missing initializer for member '_typeobject::tp_alloc'
source/gameengine/Ketsji/KX_TouchSensor.cpp:227: warning: missing initializer for member '_typeobject::tp_new'
source/gameengine/Ketsji/KX_TouchSensor.cpp:227: warning: missing initializer for member '_typeobject::tp_free'
source/gameengine/Ketsji/KX_TouchSensor.cpp:227: warning: missing initializer for member '_typeobject::tp_is_gc'
source/gameengine/Ketsji/KX_TouchSensor.cpp:227: warning: missing initializer for member '_typeobject::tp_bases'
source/gameengine/Ketsji/KX_TouchSensor.cpp:227: warning: missing initializer for member '_typeobject::tp_mro'
source/gameengine/Ketsji/KX_TouchSensor.cpp:227: warning: missing initializer for member '_typeobject::tp_cache'
source/gameengine/Ketsji/KX_TouchSensor.cpp:227: warning: missing initializer for member '_typeobject::tp_subclasses'
source/gameengine/Ketsji/KX_TouchSensor.cpp:227: warning: missing initializer for member '_typeobject::tp_weaklist'
source/gameengine/Ketsji/KX_TouchSensor.cpp:227: warning: missing initializer for member '_typeobject::tp_del'
source/gameengine/Ketsji/KX_TouchSensor.cpp:247: warning: missing initializer for member 'PyMethodDef::ml_flags'
source/gameengine/Ketsji/KX_TouchSensor.cpp:247: warning: missing initializer for member 'PyMethodDef::ml_doc'
source/gameengine/Ketsji/KX_TouchSensor.cpp:264: warning: unused parameter 'self'
source/gameengine/Ketsji/KX_TouchSensor.cpp:264: warning: unused parameter 'kwds'
source/gameengine/Ketsji/KX_TouchSensor.cpp:289: warning: unused parameter 'self'
source/gameengine/Ketsji/KX_TouchSensor.cpp:289: warning: unused parameter 'args'
source/gameengine/Ketsji/KX_TouchSensor.cpp:289: warning: unused parameter 'kwds'
source/gameengine/Ketsji/KX_TouchSensor.cpp:298: warning: unused parameter 'self'
source/gameengine/Ketsji/KX_TouchSensor.cpp:298: warning: unused parameter 'args'
source/gameengine/Ketsji/KX_TouchSensor.cpp:298: warning: unused parameter 'kwds'
source/gameengine/Ketsji/KX_TouchSensor.cpp:315: warning: unused parameter 'self'
source/gameengine/Ketsji/KX_TouchSensor.cpp:315: warning: unused parameter 'args'
source/gameengine/Ketsji/KX_TouchSensor.cpp:315: warning: unused parameter 'kwds'
source/gameengine/Ketsji/KX_TouchSensor.cpp:369: warning: unused parameter 'self'
source/gameengine/Ketsji/KX_TouchSensor.cpp:369: warning: unused parameter 'args'
source/gameengine/Ketsji/KX_TouchSensor.cpp:369: warning: unused parameter 'kwds'
source/gameengine/Ketsji/KX_TouchSensor.cpp:380: warning: unused parameter 'self'
source/gameengine/Ketsji/KX_TouchSensor.cpp:380: warning: unused parameter 'kwds'
scons: *** [/home/napoleon/blenderdev/build/linux2/source/gameengine/Ketsji/KX_TouchSensor.o] Error 1
source/gameengine/Expressions/PyObjectPlus.h:67: warning: unused parameter 'M'
source/gameengine/Expressions/PyObjectPlus.h:179: warning: unused parameter 'kwd'
source/gameengine/Physics/Sumo/Fuzzics/include/SM_Callback.h:4: warning: 'class SM_Callback' has virtual functions but non-virtual destructor
source/gameengine/Physics/Sumo/Fuzzics/include/SM_MotionState.h:37: warning: 'class SM_MotionState' has virtual functions but non-virtual destructor
source/gameengine/Physics/Sumo/Fuzzics/include/SM_Object.h:89: error: expected `)' before 'shape'
source/gameengine/Physics/Sumo/Fuzzics/include/SM_Object.h:233: error: 'DT_ObjectHandle' does not name a type
source/gameengine/Physics/Sumo/Fuzzics/include/SM_Object.h:234: error: 'DT_ShapeHandle' does not name a type
source/gameengine/Physics/Sumo/Fuzzics/include/SM_Object.h:247: error: 'DT_Bool' does not name a type
source/gameengine/Physics/Sumo/Fuzzics/include/SM_Object.h:256: error: 'DT_Bool' does not name a type
source/gameengine/Physics/Sumo/Fuzzics/include/SM_Object.h:337: error: 'DT_ShapeHandle' does not name a type
source/gameengine/Physics/Sumo/Fuzzics/include/SM_Object.h:345: error: 'DT_ObjectHandle' does not name a type
source/gameengine/Physics/common/PHY_IPhysicsEnvironment.h:55: warning: unused parameter 'debugMode'
source/gameengine/Physics/common/PHY_IPhysicsEnvironment.h:57: warning: unused parameter 'numIter'
source/gameengine/Physics/common/PHY_IPhysicsEnvironment.h:59: warning: unused parameter 'dTime'
source/gameengine/Physics/common/PHY_IPhysicsEnvironment.h:61: warning: unused parameter 'linTresh'
source/gameengine/Physics/common/PHY_IPhysicsEnvironment.h:63: warning: unused parameter 'angTresh'
source/gameengine/Physics/common/PHY_IPhysicsEnvironment.h:65: warning: unused parameter 'contactBreakingTreshold'
source/gameengine/Physics/common/PHY_IPhysicsEnvironment.h:67: warning: unused parameter 'ccdMode'
source/gameengine/Physics/common/PHY_IPhysicsEnvironment.h:69: warning: unused parameter 'sor'
source/gameengine/Physics/common/PHY_IPhysicsEnvironment.h:71: warning: unused parameter 'solverType'
source/gameengine/Physics/common/PHY_IPhysicsEnvironment.h:73: warning: unused parameter 'tau'
source/gameengine/Physics/common/PHY_IPhysicsEnvironment.h:75: warning: unused parameter 'damping'
source/gameengine/Physics/common/PHY_IPhysicsEnvironment.h:77: warning: unused parameter 'damping'
source/gameengine/Physics/common/PHY_IPhysicsEnvironment.h:79: warning: unused parameter 'epa'
source/gameengine/Ketsji/KX_TouchEventManager.cpp:60: warning: unused parameter 'coll_data'
scons: *** [/home/napoleon/blenderdev/build/linux2/source/gameengine/Ketsji/KX_TouchEventManager.o] Error 1

Posted: Mon Oct 24, 2005 8:07 pm
by kidb
jesterKing wrote:These are warnings, not errors. Please scroll up in your output, and search for the *first* error that is encountered.

/Nathan
SOLID/SOLID.h is not found but I don't know how to fix it.

Posted: Tue Oct 25, 2005 9:41 pm
by jesterKing
Check in your config.opts if the gameengine is set to 'bullet'. If so, change to 'solid'. (And make sure you do a cvs update -dP, since there were some commits in there, iirc).

/Nathan

Posted: Wed Oct 26, 2005 7:38 am
by fakeplasticdreams
jesterKing wrote:Check in your config.opts if the gameengine is set to 'bullet'. If so, change to 'solid'. (And make sure you do a cvs update -dP, since there were some commits in there, iirc).

/Nathan
What do you mean by the cvs update -dP part?

I have been building the CVS lately, but each time I do a

Code: Select all

cvs -z3 -d:pserver:anonymous@cvs.blender.org:/cvsroot/bf-blender co blender
Is there something else I should be doing?

Thank

Posted: Wed Oct 26, 2005 7:39 am
by Napoleon
I changed the game engine from bullet to solid and compiled, now this is what i get:

g++ -pipe -funsigned-char -O2 -Wall -W -DGAMEBLENDER=1 -DUSE_BULLET -DUSE_SUMO_SOLID -DNDEBUG -I/home/napoleon/blenderdev/build/linux2/source/gameengine/GamePlayer/ghost -Isource/gameengine/GamePlayer/ghost -Isource/gameengine/GamePlayer/ghost -Iintern/string -Iintern/ghost -Iintern/guardedalloc -Iintern/bmfont -Iintern/moto/include -Iintern/SoundSystem -Isource/gameengine/Rasterizer/RAS_OpenGLRasterizer -Isource/kernel/gen_system -Isource/kernel/gen_messaging -Isource/gameengine/Converter -Isource/blender/imbuf -Isource/gameengine/Ketsji -Isource/blender/blenlib -Isource/blender/blenkernel -Isource/blender/readblenfile -Isource/blender -Isource/blender/include -Isource/blender/makesdna -Isource/gameengine/Rasterizer -Isource/gameengine/GameLogic -Isource/gameengine/Expressions -Isource/gameengine/Network -Isource/gameengine/SceneGraph -Isource/gameengine/Physics/common -Isource/gameengine/Physics/Sumo -Isource/gameengine/Physics/Sumo/Fuzzics/include -Isource/gameengine/Network/LoopBackNetwork -Isource/gameengine/GamePlayer/common -Isource/blender/misc -Isource/blender/blenloader -I/usr/include/python2.4 -Iextern/solid -c -o /home/napoleon/blenderdev/build/linux2/source/gameengine/GamePlayer/ghost/GPG_KeyboardDevice.o source/gameengine/GamePlayer/ghost/GPG_KeyboardDevice.cpp
source/gameengine/GamePlayer/common/GPC_KeyboardDevice.h:73: warning: unused parameter 'inputcode'
/usr/lib/python2.4/config/libpython2.4.a(posixmodule.o): In function `posix_tmpnam':
: warning: the use of `tmpnam_r' is dangerous, better use `mkstemp'
/usr/lib/python2.4/config/libpython2.4.a(posixmodule.o): In function `posix_tempnam':
: warning: the use of `tempnam' is dangerous, better use `mkstemp'
/home/napoleon/blenderdev/build/linux2/lib/libKX_ketsji.a(KX_ConvertPhysicsObjects.o): In function `CreateBulletShapeFromMesh(RAS_MeshObject*, bool)':
KX_ConvertPhysicsObjects.cpp:(.text+0xa42): undefined reference to `ConvexHullShape::ConvexHullShape(SimdVector3*, int)'
KX_ConvertPhysicsObjects.cpp:(.text+0xe4c): undefined reference to `TriangleMesh::TriangleMesh()'
/home/napoleon/blenderdev/build/linux2/lib/libKX_ketsji.a(KX_ConvertPhysicsObjects.o): In function `KX_ConvertBulletObject(KX_GameObject*, RAS_MeshObject*, KX_Scene*, PHY_ShapeProps*, PHY_MaterialProps*, KX_ObjectProperties*)':
KX_ConvertPhysicsObjects.cpp:(.text+0x1355): undefined reference to `vtable for BoxShape'
KX_ConvertPhysicsObjects.cpp:(.text+0x1375): undefined reference to `vtable for BoxShape'
KX_ConvertPhysicsObjects.cpp:(.text+0x1555): undefined reference to `ConeShape::ConeShape(float, float)'
KX_ConvertPhysicsObjects.cpp:(.text+0x1598): undefined reference to `CylinderShapeZ::CylinderShapeZ(SimdVector3 const&)'
collect2: ld returned 1 exit status
scons: *** [blender] Error 1
scons: building terminated because of errors.

Posted: Wed Oct 26, 2005 11:27 am
by jesterKing
fakeplasticdreams wrote: What do you mean by the cvs update -dP part?
It means it'll get new files/directories if there are any, and prunes empty directories.
fakeplasticdreams wrote: I have been building the CVS lately, but each time I do a

Code: Select all

cvs -z3 -d:pserver:anonymous@cvs.blender.org:/cvsroot/bf-blender co blender
If you've checked out once a cvs, you need only to update it with

Code: Select all

cvs update -dP
Run that command in the root directory of the cvs source of blender. That way you don't need to get an entire checkout all the time, saving bandwidth both for yourself and the cvs server.

/Nathan

Posted: Wed Oct 26, 2005 11:50 am
by jesterKing
Napoleon wrote:I changed the game engine from bullet to solid and compiled, now this is what i get:

(logblabla)
/home/napoleon/blenderdev/build/linux2/lib/libKX_ketsji.a(KX_ConvertPhysicsObjects.o): In function `CreateBulletShapeFromMesh(RAS_MeshObject*, bool)':
KX_ConvertPhysicsObjects.cpp:(.text+0xa42): undefined reference to `ConvexHullShape::ConvexHullShape(SimdVector3*, int)'
KX_ConvertPhysicsObjects.cpp:(.text+0xe4c): undefined reference to `TriangleMesh::TriangleMesh()'
(logblabla)
scons: *** [blender] Error 1
scons: building terminated because of errors.
Are you sure you have a clean cvs you try to compile? If so, do a

Code: Select all

scons clean
before you build again. Hope this works now :)

/Nathan

Posted: Wed Oct 26, 2005 12:49 pm
by raphael
Hello,

I'v got the same problem since few days. Under linux, with a fresh CVS

source/gameengine/Ketsji/KX_TouchSensor.cpp:381: attention : unused parameter `
PyObject*kwds'
scons: *** [/usr/local/src/bf-blender/build/linux2/source/gameengine/Ketsji/KX_TouchSensor.o] Error 1
scons: building terminated because of errors.

Posted: Wed Oct 26, 2005 6:34 pm
by Napoleon
I have just downloaded a fresh CVS changed gameengine to solid but i still get the same error as the last one i posted. Well i suppose i will keep trying from time to time. I obviously i don't know much about software development bcos i would imagine that before one commits any change they would have compiled the whole program successfully.

BTW i tried to use cvs update -dP and i had the following error:

[napoleon@archlinux blenderdev]$ cvs update -dP cvs update: No CVSROOT specified! Please use the `-d' option
cvs [update aborted]: or set the CVSROOT environment variable.

thanks

Posted: Thu Oct 27, 2005 7:43 am
by jesterKing
Napoleon wrote:BTW i tried to use cvs update -dP and i had the following error:

[napoleon@archlinux blenderdev]$ cvs update -dP cvs update: No CVSROOT specified! Please use the `-d' option
cvs [update aborted]: or set the CVSROOT environment variable.
It looks like you're trying to do an update on a downloaded daily tarball. Unfortunately, that will not work. I presumed you were using a fresh checkout (in which case the right CVSROOT should be in the CVS/Root files all over the source).

Could you both Napoleon and raphael give a bit more info on what kind of build system you are using? Operating system, compiler used, etc.

/Nathan

Posted: Thu Oct 27, 2005 8:57 am
by kidb
jesterKing wrote:
Napoleon wrote:
Could you both Napoleon and raphael give a bit more info on what kind of build system you are using? Operating system, compiler used, etc.

/Nathan
I presume they are trying to build with scons. The problem is that scons complains about a missing SOLID/SOLID.h. source/gameengine/Physics/Sumo/Fuzzics/include/SM_Object.h:37:25: SOLID/SOLID.h: No such file or directory

http://projects.blender.org/viewcvs/vie ... bf-blender

Posted: Thu Oct 27, 2005 9:54 am
by jesterKing
kidb wrote:
jesterKing wrote:
Napoleon wrote:
Could you both Napoleon and raphael give a bit more info on what kind of build system you are using? Operating system, compiler used, etc.

/Nathan
I presume they are trying to build with scons. The problem is that scons complains about a missing SOLID/SOLID.h. source/gameengine/Physics/Sumo/Fuzzics/include/SM_Object.h:37:25: SOLID/SOLID.h: No such file or directory

http://projects.blender.org/viewcvs/vie ... bf-blender
Yah, I didn't mean whether they use make or scons. Their output was already quite obvious, and I'm supposed to know scons quite well :) The solid error got solved by setting the right game engine in config.opts (from 'bullet' to 'solid'). The problem is now OpenAL, which is in this particular case not related to SOLID. What I want to know is if the necessary header files have been installed, and what OS they are using, so this gets at least documented here in the forum.

/Nathan

Posted: Thu Oct 27, 2005 9:55 am
by jesterKing
raphael wrote:Hello,

I'v got the same problem since few days. Under linux, with a fresh CVS

source/gameengine/Ketsji/KX_TouchSensor.cpp:381: attention : unused parameter `
PyObject*kwds'
scons: *** [/usr/local/src/bf-blender/build/linux2/source/gameengine/Ketsji/KX_TouchSensor.o] Error 1
scons: building terminated because of errors.
raphael, the line you posted is not related to the error SCons bails out on. That line just tells us that a parameter has not been used in the code, while it has been declared. (So probably the compiler will just optimise that away).

Again, scroll up until you get to the real first error message.

/Nathan